{"text_format":"1","workbook":"xlsx","n_sheets":6,"sheets":["Invulsheet","Beheer","Waardeberekening","dagrooster invoer","dagroosterberekening","dagroosteroverzicht"],"not_rendered":{"charts":0,"images":0,"macros":1,"external_links":0,"defined_names":24,"comments":0,"pivot_tables":0},"unopened":[],"bounds":{"document_bytes":16777216,"sheet_cells":100000,"rows_first":2000,"rows_last":500,"rows_between":2000,"halvings":0,"cell_chars":16384,"cell_head_chars":4096},"cells_cut":0,"cells_raw":0,"read":"whole","date_system":"1900"}

{"sheet":"Invulsheet","index":0,"n_rows":55,"n_cols":32,"rows_kept":55,"cut":false,"hidden":false,"merged":[[39,22,39,28],[25,22,25,28],[12,22,12,28],[23,10,24,17],[12,10,12,17],[13,10,13,16],[20,10,20,16],[15,10,15,16],[22,10,22,17],[1,1,2,17],[5,1,6,8],[4,1,4,8],[8,1,8,8],[9,1,9,7],[5,10,5,16],[6,10,6,16],[7,10,7,16],[8,10,8,16],[9,10,9,16],[4,20,4,21],[26,1,26,8],[10,1,10,7],[4,10,4,17],[11,1,11,8],[18,10,18,16],[12,1,12,8],[13,1,13,2],[13,3,13,4],[13,5,14,5],[13,6,14,6],[13,7,14,7],[13,8,14,8],[10,10,10,16],[14,10,14,16],[16,10,16,16]]}
[]
[null,"Ploegendiensttoeslag"]
[]
[]
[null,"Roosternaam:",null,null,null,null,null,null,null,null,"Informatie",null,null,null,null,null,null,null,null,null,"checklist"]
[null,null,null,null,null,null,null,null,null,null,"Gemiddeld aantal betaaluren per week:",null,null,null,null,null,null,{"$f":"I10*40","v":0},null,null,"1) Vul Roosternaam",{"$f":"IF(ISBLANK(B6),\"\",\"X\")","v":""}]
[null,null,null,null,null,null,null,null,null,null,"Aantal uren pauze:",null,null,null,null,null,null,{"$f":"SUM(AF15:AF24)*24","v":0},null,null,"2) Vul Contractpercentage",{"$f":"IF(AND(V6=\"X\",NOT(ISBLANK(I10))),\"X\",\"\")","v":""}]
[null,null,null,null,null,null,null,null,null,null,"Aantal gewerkte uren:",null,null,null,null,null,null,{"$f":"SUM(AE15:AE24)*24","v":0},null,null,"3) Vul Aantal weken",{"$f":"IF(AND(V7=\"X\",NOT(ISBLANK(I11))),\"X\",\"\")","v":""}]
[null,"Contract en Roosterinformatie",null,null,null,null,null,null,null,null,"Aantal aanwezige uren:",null,null,null,null,null,null,{"$f":"SUM(AD15:AD24)*24","v":0},null,null,"4) Vul de gebruikte dagroosters",{"$f":"IF(AND(V8=\"X\",NOT(ISBLANK(C16))),\"X\",\"\")","v":""}]
[null,"Contractpercentage:",null,null,null,null,null,null,null,null,"Gemiddeld aantal gewerkte uren per week:",null,null,null,null,null,null,{"$f":"R8/I11","v":{"$error":"#DIV/0!"}},null,null,"5) Klik op dagrooster toevoegen indien dat vermeld staat",{"$f":"IF(AND(V9=\"X\",B26=\"\"),\"X\",\"\")","v":""}]
[null,"Aantal weken:",null,null,null,null,null,null,null,null,"Uurwaarde:",null,null,null,null,null,null,{"$f":"SUM(W42:AC51)*24/R9","v":{"$error":"#DIV/0!"}},null,null,"6) Vul rooster in",{"$f":"IF(AND(V10=\"X\",B12=\"\"),\"X\",\"\")","v":""},"ja"]
[null,{"$f":"IF(ISBLANK(I11),\"\",IF(SUM(A29:A55,J29:J55)=I11,\"\",\"Aantal weken rooster matcht niet met ingevulde weken\"))","v":""},null,null,null,null,null,null,null,null,null,null,null,null,null,null,null,null,null,null,"7) Vul Vakantieinvoer in (indien daar om gevraagd wordt)",{"$f":"IF(AND(V11=\"X\",R14=0),\"X\",IF(ISBLANK(R16),\"\",\"X\"))","v":""},"nee"]
[null,"Gebruikte dagroosters",null,null,null,null,null,null,null,null,"Vakantieuren",null,null,null,null,null,null,null,null,null,null,null,"hoe vaak komt het dagrooster voor"]
[null,"werktijd",null,"pauze",null,"Dag-rooster","uren aanwezig","uren gewerkt","uren pauze",null,"aantal uren te kort per week",null,null,null,null,null,null,{"$f":"IF(V11=\"X\",R6-R10,0)","v":0},null,null,null,null,"mawaarde totaal","diwaarde totaal","wowaarde totaal","dowaarde totaal","vrwaarde totaal","zawaarde totaal","zowaarde totaal","totaal aanwezig","totaal gewerkt","totaal pauze"]
[null,"van","tot","van","tot",null,null,null,null,null,"uren te kort op jaarbasis",null,null,null,null,null,null,{"$f":"R14*365.25/7","v":0},null,null,null,null,{"$f":"COUNTIF(C$29:C$55,$F16)+COUNTIF(L$29:L$55,$F16)","v":0},{"$f":"COUNTIF(D$29:D$55,$F16)+COUNTIF(M$29:M$55,$F16)","v":0},0,0,0,0,0,{"$f":"IFERROR(SUM(W15:AC15)*G16,0)","v":0},{"$f":"IFERROR(SUM(W15:AC15)*H16,0)","v":0},{"$f":"IFERROR(SUM(W15:AC15)*I16,0)","v":0}]
[null,null,null,null,null,{"$f":"IFERROR(IF(ISBLANK(C16),\" \",VLOOKUP(B16&C16&D16&E16,dagroosteroverzicht!E:F,2,FALSE)),\"!\")","v":" "},{"$f":"IF(ISBLANK(C16),\"\",IF(B16<=C16,C16-B16,(1+C16)-B16))","v":""},{"$f":"IF(ISBLANK(C16),\"\",G16-I16)","v":""},{"$f":"IF(ISBLANK(C16),\"\",IF(IF(D16<=E16,E16-D16,(1+E16)-D16)=0,\"0\",IF(D16<=E16,E16-D16,(1+E16)-D16)))","v":""},null,"aantal in te leveren vakantieuren op jaarbasis",null,null,null,null,null,null,null,null,null,null,null,0,{"$f":"COUNTIF(D$29:D$55,$F17)+COUNTIF(M$29:M$55,$F17)","v":0},{"$f":"COUNTIF(E$29:E$55,$F17)+COUNTIF(N$29:N$55,$F17)","v":0},{"$f":"COUNTIF(F$29:F$55,$F17)+COUNTIF(O$29:O$55,$F17)","v":0},{"$f":"COUNTIF(G$29:G$55,$F17)+COUNTIF(P$29:P$55,$F17)","v":0},{"$f":"COUNTIF(H$29:H$55,$F17)+COUNTIF(Q$29:Q$55,$F17)","v":0},{"$f":"COUNTIF(I$29:I$55,$F17)+COUNTIF(R$29:R$55,$F17)","v":0},{"$f":"IFERROR(SUM(W16:AC16)*G17,0)","v":0},{"$f":"IFERROR(SUM(W16:AC16)*H17,0)","v":0},{"$f":"IFERROR(SUM(W16:AC16)*I17,0)","v":0}]
[null,null,null,null,null,{"$f":"IFERROR(IF(ISBLANK(C17),\" \",VLOOKUP(B17&C17&D17&E17,dagroosteroverzicht!E:F,2,FALSE)),\"!\")","v":" "},{"$f":"IF(ISBLANK(C17),\"\",IF(B17<=C17,C17-B17,(1+C17)-B17))","v":""},{"$f":"IF(ISBLANK(C17),\"\",G17-I17)","v":""},{"$f":"IF(ISBLANK(C17),\"\",IF(IF(D17<=E17,E17-D17,(1+E17)-D17)=0,\"0\",IF(D17<=E17,E17-D17,(1+E17)-D17)))","v":""},null,"Uurwaarde gecorrigeerd naar aantal gemaakte en ingeleverde uren per jaar",null,null,null,null,null,null,{"$f":"(R10+(R16/365.25*7))/R6*R11","v":{"$error":"#DIV/0!"}},null,null,null,null,0,0,0,0,0,0,0,0,0,0]
[null,null,null,null,null,{"$f":"IFERROR(IF(ISBLANK(C18),\" \",VLOOKUP(B18&C18&D18&E18,dagroosteroverzicht!E:F,2,FALSE)),\"!\")","v":" "},"","","",null,null,null,null,null,null,null,null,null,null,null,null,null,0,0,0,0,0,0,0,0,0,0]
[null,null,null,null,null,{"$f":"IFERROR(IF(ISBLANK(C19),\" \",VLOOKUP(B19&C19&D19&E19,dagroosteroverzicht!E:F,2,FALSE)),\"!\")","v":" "},"","","",null,null,null,null,null,null,null,null,null,null,null,null,null,0,0,0,0,0,0,0,0,0,0]
[null,null,null,null,null,{"$f":"IFERROR(IF(ISBLANK(C20),\" \",VLOOKUP(B20&C20&D20&E20,dagroosteroverzicht!E:F,2,FALSE)),\"!\")","v":" "},"","","",null,null,null,null,null,null,null,null,null,null,null,null,null,0,0,0,0,0,0,0,0,0,0]
{"$rows_left_out":36}
{"sheet":"Beheer","index":1,"n_rows":97,"n_cols":9,"rows_kept":97,"cut":false,"hidden":false,"merged":[]}
["van","tot","maandag","dinsdag","woensdag","donderdag","vrijdag","zaterdag","zondag"]
["00:00:00","00:15:00",0.4,0.4,0.4,0.4,0.4,0.4,1.2]
[{"$f":"B2","v":"00:15:00"},"00:30:00",0.4,0.4,0.4,0.4,0.4,0.4,1.2]
["00:30:00","00:45:00",0.4,0.4,0.4,0.4,0.4,0.4,1.2]
["00:45:00","01:00:00",0.4,0.4,0.4,0.4,0.4,0.4,1.2]
["01:00:00","01:15:00",0.4,0.4,0.4,0.4,0.4,0.4,1.2]
["01:15:00","01:30:00",0.4,0.4,0.4,0.4,0.4,0.4,1.2]
["01:30:00","01:45:00",0.4,0.4,0.4,0.4,0.4,0.4,1.2]
["01:45:00","02:00:00",0.4,0.4,0.4,0.4,0.4,0.4,1.2]
["02:00:00","02:15:00",0.4,0.4,0.4,0.4,0.4,0.4,1.2]
["02:15:00","02:30:00",0.4,0.4,0.4,0.4,0.4,0.4,1.2]
["02:30:00","02:45:00",0.4,0.4,0.4,0.4,0.4,0.4,1.2]
["02:45:00","03:00:00",0.4,0.4,0.4,0.4,0.4,0.4,1.2]
["03:00:00","03:15:00",0.4,0.4,0.4,0.4,0.4,0.4,1.2]
["03:15:00","03:30:00",0.4,0.4,0.4,0.4,0.4,0.4,1.2]
["03:30:00","03:45:00",0.4,0.4,0.4,0.4,0.4,0.4,1.2]
["03:45:00","04:00:00",0.4,0.4,0.4,0.4,0.4,0.4,1.2]
["04:00:00","04:15:00",0.4,0.4,0.4,0.4,0.4,0.4,1.2]
["04:15:00","04:30:00",0.4,0.4,0.4,0.4,0.4,0.4,1.2]
["04:30:00","04:45:00",0.4,0.4,0.4,0.4,0.4,0.4,1.2]
{"$rows_left_out":78}
{"sheet":"Waardeberekening","index":2,"n_rows":673,"n_cols":8,"rows_kept":673,"cut":false,"hidden":true,"merged":[]}
["dag","van","tot","percentage","overlap","overlap opvolgende dag","waarde huidige dag","waarde volgende dag"]
["maandag","00:00:00","00:15:00",{"$f":"Beheer!C2","v":0.4},{"$f":"MAX(0,MIN(dagroosterberekening!$H$3,C2)-MAX(dagroosterberekening!$G$3,B2))","v":"00:00:00"},{"$f":"MAX(0,MIN(dagroosterberekening!$J$3,C2)-MAX(dagroosterberekening!$I$3,B2))","v":"00:00:00"},{"$f":"ROUND((E2*1)+(E2*D2),10)","v":0},{"$f":"ROUND((F2*1)+(F2*D2),10)","v":0}]
["maandag",{"$f":"C2","v":"00:15:00"},"00:30:00",{"$f":"Beheer!C3","v":0.4},{"$f":"MAX(0,MIN(dagroosterberekening!$H$3,C3)-MAX(dagroosterberekening!$G$3,B3))","v":"00:00:00"},{"$f":"MAX(0,MIN(dagroosterberekening!$J$3,C3)-MAX(dagroosterberekening!$I$3,B3))","v":"00:00:00"},{"$f":"ROUND((E3*1)+(E3*D3),10)","v":0},{"$f":"ROUND((F3*1)+(F3*D3),10)","v":0}]
["maandag","00:30:00","00:45:00",{"$f":"Beheer!C4","v":0.4},{"$f":"MAX(0,MIN(dagroosterberekening!$H$3,C4)-MAX(dagroosterberekening!$G$3,B4))","v":"00:00:00"},{"$f":"MAX(0,MIN(dagroosterberekening!$J$3,C4)-MAX(dagroosterberekening!$I$3,B4))","v":"00:00:00"},0,0]
["maandag","00:45:00","01:00:00",{"$f":"Beheer!C5","v":0.4},{"$f":"MAX(0,MIN(dagroosterberekening!$H$3,C5)-MAX(dagroosterberekening!$G$3,B5))","v":"00:00:00"},{"$f":"MAX(0,MIN(dagroosterberekening!$J$3,C5)-MAX(dagroosterberekening!$I$3,B5))","v":"00:00:00"},0,0]
["maandag","01:00:00","01:15:00",{"$f":"Beheer!C6","v":0.4},{"$f":"MAX(0,MIN(dagroosterberekening!$H$3,C6)-MAX(dagroosterberekening!$G$3,B6))","v":"00:00:00"},{"$f":"MAX(0,MIN(dagroosterberekening!$J$3,C6)-MAX(dagroosterberekening!$I$3,B6))","v":"00:00:00"},0,0]
["maandag","01:15:00","01:30:00",{"$f":"Beheer!C7","v":0.4},{"$f":"MAX(0,MIN(dagroosterberekening!$H$3,C7)-MAX(dagroosterberekening!$G$3,B7))","v":"00:00:00"},{"$f":"MAX(0,MIN(dagroosterberekening!$J$3,C7)-MAX(dagroosterberekening!$I$3,B7))","v":"00:00:00"},0,0]
["maandag","01:30:00","01:45:00",{"$f":"Beheer!C8","v":0.4},{"$f":"MAX(0,MIN(dagroosterberekening!$H$3,C8)-MAX(dagroosterberekening!$G$3,B8))","v":"00:00:00"},{"$f":"MAX(0,MIN(dagroosterberekening!$J$3,C8)-MAX(dagroosterberekening!$I$3,B8))","v":"00:00:00"},0,0]
["maandag","01:45:00","02:00:00",{"$f":"Beheer!C9","v":0.4},{"$f":"MAX(0,MIN(dagroosterberekening!$H$3,C9)-MAX(dagroosterberekening!$G$3,B9))","v":"00:00:00"},{"$f":"MAX(0,MIN(dagroosterberekening!$J$3,C9)-MAX(dagroosterberekening!$I$3,B9))","v":"00:00:00"},0,0]
["maandag","02:00:00","02:15:00",{"$f":"Beheer!C10","v":0.4},{"$f":"MAX(0,MIN(dagroosterberekening!$H$3,C10)-MAX(dagroosterberekening!$G$3,B10))","v":"00:00:00"},{"$f":"MAX(0,MIN(dagroosterberekening!$J$3,C10)-MAX(dagroosterberekening!$I$3,B10))","v":"00:00:00"},0,0]
["maandag","02:15:00","02:30:00",{"$f":"Beheer!C11","v":0.4},{"$f":"MAX(0,MIN(dagroosterberekening!$H$3,C11)-MAX(dagroosterberekening!$G$3,B11))","v":"00:00:00"},{"$f":"MAX(0,MIN(dagroosterberekening!$J$3,C11)-MAX(dagroosterberekening!$I$3,B11))","v":"00:00:00"},0,0]
["maandag","02:30:00","02:45:00",{"$f":"Beheer!C12","v":0.4},{"$f":"MAX(0,MIN(dagroosterberekening!$H$3,C12)-MAX(dagroosterberekening!$G$3,B12))","v":"00:00:00"},{"$f":"MAX(0,MIN(dagroosterberekening!$J$3,C12)-MAX(dagroosterberekening!$I$3,B12))","v":"00:00:00"},0,0]
["maandag","02:45:00","03:00:00",{"$f":"Beheer!C13","v":0.4},{"$f":"MAX(0,MIN(dagroosterberekening!$H$3,C13)-MAX(dagroosterberekening!$G$3,B13))","v":"00:00:00"},{"$f":"MAX(0,MIN(dagroosterberekening!$J$3,C13)-MAX(dagroosterberekening!$I$3,B13))","v":"00:00:00"},0,0]
["maandag","03:00:00","03:15:00",{"$f":"Beheer!C14","v":0.4},{"$f":"MAX(0,MIN(dagroosterberekening!$H$3,C14)-MAX(dagroosterberekening!$G$3,B14))","v":"00:00:00"},{"$f":"MAX(0,MIN(dagroosterberekening!$J$3,C14)-MAX(dagroosterberekening!$I$3,B14))","v":"00:00:00"},0,0]
["maandag","03:15:00","03:30:00",{"$f":"Beheer!C15","v":0.4},{"$f":"MAX(0,MIN(dagroosterberekening!$H$3,C15)-MAX(dagroosterberekening!$G$3,B15))","v":"00:00:00"},{"$f":"MAX(0,MIN(dagroosterberekening!$J$3,C15)-MAX(dagroosterberekening!$I$3,B15))","v":"00:00:00"},0,0]
["maandag","03:30:00","03:45:00",{"$f":"Beheer!C16","v":0.4},{"$f":"MAX(0,MIN(dagroosterberekening!$H$3,C16)-MAX(dagroosterberekening!$G$3,B16))","v":"00:00:00"},{"$f":"MAX(0,MIN(dagroosterberekening!$J$3,C16)-MAX(dagroosterberekening!$I$3,B16))","v":"00:00:00"},0,0]
["maandag","03:45:00","04:00:00",{"$f":"Beheer!C17","v":0.4},{"$f":"MAX(0,MIN(dagroosterberekening!$H$3,C17)-MAX(dagroosterberekening!$G$3,B17))","v":"00:00:00"},{"$f":"MAX(0,MIN(dagroosterberekening!$J$3,C17)-MAX(dagroosterberekening!$I$3,B17))","v":"00:00:00"},0,0]
["maandag","04:00:00","04:15:00",{"$f":"Beheer!C18","v":0.4},{"$f":"MAX(0,MIN(dagroosterberekening!$H$3,C18)-MAX(dagroosterberekening!$G$3,B18))","v":"00:00:00"},{"$f":"MAX(0,MIN(dagroosterberekening!$J$3,C18)-MAX(dagroosterberekening!$I$3,B18))","v":"00:00:00"},0,0]
["maandag","04:15:00","04:30:00",{"$f":"Beheer!C19","v":0.4},{"$f":"MAX(0,MIN(dagroosterberekening!$H$3,C19)-MAX(dagroosterberekening!$G$3,B19))","v":"00:00:00"},{"$f":"MAX(0,MIN(dagroosterberekening!$J$3,C19)-MAX(dagroosterberekening!$I$3,B19))","v":"00:00:00"},0,0]
["maandag","04:30:00","04:45:00",{"$f":"Beheer!C20","v":0.4},{"$f":"MAX(0,MIN(dagroosterberekening!$H$3,C20)-MAX(dagroosterberekening!$G$3,B20))","v":"00:00:00"},{"$f":"MAX(0,MIN(dagroosterberekening!$J$3,C20)-MAX(dagroosterberekening!$I$3,B20))","v":"00:00:00"},0,0]
{"$rows_left_out":654}
{"sheet":"dagrooster invoer","index":3,"n_rows":1,"n_cols":5,"rows_kept":1,"cut":false,"hidden":true,"merged":[]}
["van","tot","van","tot","dagroostercode"]

{"sheet":"dagroosterberekening","index":4,"n_rows":3,"n_cols":19,"rows_kept":3,"cut":false,"hidden":true,"merged":[[0,0,0,3],[0,6,0,7],[0,8,0,9]]}
["invoer",null,null,null,"werktijd","pauze","huidige dag",null,"opvolgende dag"]
["van","tot","van","tot","over de nacht","over de nacht","van","tot","van","tot","aanwezig","gewerkt","maandagwaarde","dinsdagwaarde","woensdagwaarde","donderdagwaarde","vrijdagwaarde","zaterdagwaarde","zondagwaarde"]
["08:00:00","08:08:00",null,null,{"$f":"IF(ISBLANK(B3),\"\",IF(B3>=A3,0,1))","v":0},{"$f":"IF(ISBLANK(B3),\"\",IF(D3>=C3,0,1))","v":0},{"$f":"IF(ISBLANK(B3),\"\",A3)","v":"08:00:00"},{"$f":"IF(ISBLANK(B3),\"\",IF(E3=1,1,B3))","v":"08:08:00"},{"$f":"IF(ISBLANK(B3),\"\",IF(E3=1,0,0))","v":"00:00:00"},{"$f":"IF(ISBLANK(B3),\"\",IF(E3=1,B3,0))","v":"00:00:00"},{"$f":"IF(ISBLANK(B3),\"\",(B3+E3)-A3)","v":"00:08:00"},{"$f":"IF(ISBLANK(B3),\"\",((B3+E3)-A3)-((D3+F3)-C3))","v":"00:08:00"},{"$f":"IF(ISBLANK(B3),\"\",SUM(mawaarde)+IF(E3=1,SUM(diwaardevd),0))","v":5.5555556000000004E-3},{"$f":"IF(ISBLANK(B3),\"\",SUM(diwaarde)+IF(E3=1,SUM(wowaardevd),0))","v":5.5555556000000004E-3},{"$f":"IF(ISBLANK(B3),\"\",SUM(wowaarde)+IF(E3=1,SUM(dowaardevd),0))","v":5.5555556000000004E-3},{"$f":"IF(ISBLANK(B3),\"\",SUM(dowaarde)+IF(E3=1,SUM(vrwaardevd),0))","v":5.5555556000000004E-3},{"$f":"IF(ISBLANK(B3),\"\",SUM(vrwaarde)+IF(E3=1,SUM(zawaardevd),0))","v":5.5555556000000004E-3},{"$f":"IF(ISBLANK(B3),\"\",SUM(zawaarde)+IF(E3=1,SUM(zowaardevd),0))","v":7.7777777999999999E-3},{"$f":"IF(ISBLANK(B3),\"\",SUM(zowaarde)+IF(E3=1,SUM(mawaardevd),0))","v":1.2222222200000001E-2}]

{"sheet":"dagroosteroverzicht","index":5,"n_rows":132,"n_cols":15,"rows_kept":132,"cut":false,"hidden":true,"merged":[]}
["van","tot","van","tot","uniek","dagroostercode","aanwezig","gewerkt","maandagwaarde","dinsdagwaarde","woensdagwaarde","donderdagwaarde","vrijdagwaarde","zaterdagwaarde","zondagwaarde"]
["x","x","x","x","x","voorbeeld","x","x","x","x","x","x","x","x","x"]
["06:30:00","15:00:00","10:30:00","11:00:00",{"$f":"A3&B3&C3&D3","v":"0,2708333333333330,6250,43750,458333333333333"},"a",0.35416666666666669,0.33333333333333337,0.36250000100000013,0.36250000100000013,0.36250000100000013,0.36250000100000013,0.36250000100000013,0.59583333299999997,0.77916666780000021]
["14:45:00","23:15:00","18:45:00","19:15:00","0,6145833333333330,968750,781250,802083333333333","b",0.35416666666666663,0.33333333333333326,0.44166666639999996,0.44166666639999996,0.44166666639999996,0.44166666639999996,0.44166666639999996,0.77916666780000021,0.77916666780000021]
["14:00:00","22:30:00","18:00:00","18:30:00","0,5833333333333330,93750,750,770833333333333","c",0.35416666666666663,0.33333333333333326,0.42916666659999997,0.42916666659999997,0.42916666659999997,0.42916666659999997,0.42916666659999997,0.77916666780000021,0.77916666780000021]
["05:30:00","14:00:00","11:45:00","12:15:00","0,2291666666666670,5833333333333330,4895833333333330,510416666666667","d",0.35416666666666674,0.33333333333333343,0.37916666740000016,0.37916666740000016,0.37916666740000016,0.37916666740000016,0.37916666740000016,0.56249999939999995,0.77916666780000021]
["06:30:00","15:00:00","11:00:00","11:30:00","0,2708333333333330,6250,4583333333333330,479166666666667","e",0.35416666666666669,0.33333333333333331,0.36250000100000013,0.36250000100000013,0.36250000100000013,0.36250000100000013,0.36250000100000013,0.59583333299999997,0.77916666780000021]
["15:00:00","23:30:00","19:00:00","19:30:00","0,6250,9791666666666670,7916666666666670,8125","f",0.35416666666666663,0.33333333333333326,0.445833333,0.445833333,0.445833333,0.445833333,0.445833333,0.77916666780000021,0.77916666780000021]
["23:30:00","06:30:00",null,null,"0,9791666666666670,270833333333333","g",0.29166666666666663,0.29166666666666663,0.40833333239999997,0.40833333239999997,0.40833333239999997,0.40833333239999997,0.40833333239999997,0.64166666759999991,0.42499999919999998]
["06:30:00","15:00:00","12:30:00","13:00:00","0,2708333333333330,6250,5208333333333330,541666666666667","h",0.35416666666666669,0.33333333333333343,0.36250000100000013,0.36250000100000013,0.36250000100000013,0.36250000100000013,0.36250000100000013,0.59583333299999997,0.77916666780000021]
["09:00:00","17:30:00","13:00:00","13:30:00","0,3750,7291666666666670,5416666666666670,5625","i",0.35416666666666663,0.33333333333333326,0.35416666780000011,0.35416666780000011,0.35416666780000011,0.35416666780000011,0.35416666780000011,0.67916666699999995,0.77916666780000021]
["15:00:00","23:30:00","17:00:00","17:30:00","0,6250,9791666666666670,7083333333333330,729166666666667","j",0.35416666666666663,0.33333333333333337,0.445833333,0.445833333,0.445833333,0.445833333,0.445833333,0.77916666780000021,0.77916666780000021]
["19:30:00","23:30:00",null,null,"0,81250,979166666666667","k",0.16666666666666663,0.16666666666666663,0.23333333279999999,0.23333333279999999,0.23333333279999999,0.23333333279999999,0.23333333279999999,0.36666666719999991,0.36666666719999991]
["09:00:00","13:00:00",null,null,"0,3750,541666666666667","l",0.16666666666666663,0.16666666666666663,0.16666666719999995,0.16666666719999995,0.16666666719999995,0.16666666719999995,0.16666666719999995,0.26666666639999997,0.36666666719999991]
["15:00:00","19:00:00",null,null,"0,6250,791666666666667","m",0.16666666666666663,0.16666666666666663,0.18333333359999998,0.18333333359999998,0.18333333359999998,0.18333333359999998,0.18333333359999998,0.36666666719999991,0.36666666719999991]
["15:00:00","22:00:00","17:30:00","18:00:00","0,6250,9166666666666670,7291666666666670,75","n",0.29166666666666663,0.27083333333333326,0.35833333319999999,0.35833333319999999,0.35833333319999999,0.35833333319999999,0.35833333319999999,0.64166666760000002,0.64166666760000002]
["15:00:00","23:30:00","17:45:00","18:15:00","0,6250,9791666666666670,7395833333333330,760416666666667","o",0.35416666666666663,0.33333333333333337,0.445833333,0.445833333,0.445833333,0.445833333,0.445833333,0.77916666780000021,0.77916666780000021]
["15:00:00","00:00:00","17:45:00","18:15:00","0,62500,7395833333333330,760416666666667","p",0.375,0.35416666666666674,0.4749999996,0.4749999996,0.4749999996,0.4749999996,0.4749999996,0.82500000120000028,0.82500000120000028]
["21:30:00","06:30:00","01:45:00","02:15:00","0,8958333333333330,2708333333333330,07291666666666670,09375","q",0.37499999999999989,0.35416666666666657,0.52499999879999992,0.52499999879999992,0.52499999879999992,0.52499999879999992,0.52499999879999992,0.82500000119999994,0.60833333280000002]
["23:30:00","06:30:00","","","0,9791666666666670,270833333333333","r",0.29166666666666663,0.29166666666666663,0.40833333239999997,0.40833333239999997,0.40833333239999997,0.40833333239999997,0.40833333239999997,0.64166666759999991,0.42499999919999998]
{"$rows_left_out":112}